Target
Beta-galactosidase
Ligand
BDBM50288853
Substrate
Meas. Tech.
ChEBML_215880
IC50
>1000000±n/a nM
Citation
 Igarashi, YIchikawa, MIchikawa, Y Synthesis of a new inhibitor of α-fucosidase Bioorg Med Chem Lett 6:553-558 (1996)    Article 
Target
Name:
Beta-galactosidase
Synonyms:
Acid beta-galactosidase ELNR1 GLB1 | Lactase
Type:
PROTEIN
Mol. Mass.:
76074.43
Organism:
Homo sapiens (Human)
Description:
ChEMBL_215886
Residue:
677
  
Inhibitor
Name:
BDBM50288853
Synonyms:
1-Butyl-5-methyl-piperidine-3,4-diol | CHEMBL356023
Type:
Small organic molecule
Emp. Form.:
C10H21NO2
Mol. Mass.:
187.2792
SMILES:
CCCCN1CC(C)C(O)C(O)C1
: