Target
72 kDa type IV collagenase
Ligand
BDBM50057090
Substrate
Meas. Tech.
ChEBML_101928
Ki
3.5±n/a nM
Citation
 Chapman, KTDurette, PLCaldwell, CGSperow, KMNiedzwiecki, LMHarrison, RKSaphos, CChristen, AJOlszewski, JMMoore, VLMacCoss, MHagmann, WK Orally active inhibitors of stromelysin-1 (MMP-3) Bioorg Med Chem Lett 6:803-806 (1996)    Article 
Target
Name:
72 kDa type IV collagenase
Synonyms:
72 kDa gelatinase CLG4A Gelatinase A (MMP-2) MMP2_HUMAN Matrix metalloproteinase-2 (MMP 2) Matrix metalloproteinases 2 (MMP-2) | TBE-1
Type:
Enzyme
Mol. Mass.:
73870.36
Organism:
Homo sapiens (Human)
Description:
P08253
Residue:
660
  
Inhibitor
Name:
BDBM50057090
Synonyms:
(R)-2-((S)-1-((S)-4-methyl-1-oxo-1-(phenylamino)pentan-2-ylamino)-1-oxo-4-(4-propylphenyl)butan-2-ylamino)propanoic acid (R)-2-[(S)-1-(3-Methyl-1-phenylcarbamoyl-butylcarbamoyl)-3-(4-propyl-phenyl)-propylamino]-propionic acid | CHEMBL8474
Type:
Small organic molecule
Emp. Form.:
C28H39N3O4
Mol. Mass.:
481.627
SMILES:
CCCc1ccc(CC[C@H](N[C@H](C)C(O)=O)C(=O)N[C@@H](CC(C)C)C(=O)Nc2ccccc2)cc1
: