Target
Stromelysin-1
Ligand
BDBM50289128
Substrate
Meas. Tech.
ChEBML_102093
Ki
1.9±n/a nM
Citation
 Chapman, KTDurette, PLCaldwell, CGSperow, KMNiedzwiecki, LMHarrison, RKSaphos, CChristen, AJOlszewski, JMMoore, VLMacCoss, MHagmann, WK Orally active inhibitors of stromelysin-1 (MMP-3) Bioorg Med Chem Lett 6:803-806 (1996)    Article 
Target
Name:
Stromelysin-1
Synonyms:
MMP-3 MMP3_HUMAN Matrix metalloproteinase 3 Matrix metalloproteinase-3 (MMP-3) SL-1 Stromelysin 1 | Transin-1
Type:
Enzyme
Mol. Mass.:
53973.13
Organism:
Homo sapiens (Human)
Description:
P08254
Residue:
477
  
Inhibitor
Name:
BDBM50289128
Synonyms:
(R)-6-(1,3-Dioxo-1,3-dihydro-isoindol-2-yl)-2-[(S)-1-(3-methyl-1-phenylcarbamoyl-butylcarbamoyl)-3-(4-propyl-phenyl)-propylamino]-hexanoic acid | CHEMBL167302
Type:
Small organic molecule
Emp. Form.:
C39H48N4O6
Mol. Mass.:
668.8216
SMILES:
CCCc1ccc(CC[C@H](N[C@H](CCCCN2C(=O)c3ccccc3C2=O)C(O)=O)C(=O)N[C@@H](CC(C)C)C(=O)Nc2ccccc2)cc1
: