Target
Protein farnesyltransferase subunit beta/geranylgeranyltransferase type-1 subunit alpha
Ligand
BDBM50289150
Substrate
Meas. Tech.
ChEBML_70718
Ki
170±n/a nM
Citation
 Coval, SJPatton, RWPetrin, JMJames, LRothofsky, MLLin, SLPatel, MReed, JKMcPhail, ATBishop, WR A cembranolide diterpene farnesyl protein transferase inhibitor from the marine soft coral Lobophytum cristagalli Bioorg Med Chem Lett 6:909-912 (1996)    Article 
Target
Name:
Protein farnesyltransferase subunit beta/geranylgeranyltransferase type-1 subunit alpha
Synonyms:
Farnesyltransferase (FTase) Protein Farnesyltransferase (PFT) Chain B | Protein farnesyltransferase
Type:
Protein Complex
Mol. Mass.:
Description:
To express recombinant enzyme in E. coli, the cloned human alpha and beta subunits were co-expressed from a plasmid, in which their expression was translationally coupled.
Components:
This complex has 2 components.
Component 1
Name:
Protein farnesyltransferase subunit beta
Synonyms:
CAAX farnesyltransferase subunit alpha FNTB FTase-alpha GGTase-I-alpha Protein farnesyl/geranylgeranyl transferase Protein farnesyltransferase subunit beta Protein farnesyltransferase/geranylgeranyltransferase type-1 subunit alpha Ras proteins prenyltransferase subunit beta | Type I protein geranyl-geranyltransferase subunit alpha
Type:
Enzyme Subunit
Mol. Mass.:
48766.02
Organism:
Homo sapiens (Human)
Description:
Protein farnesyltransferase subunit beta
Residue:
437
  
Component 2
Name:
Protein farnesyltransferase/geranylgeranyltransferase type-1 subunit alpha
Synonyms:
CAAX farnesyltransferase alpha subunit FNTA_HUMAN FTase-alpha Geranylgeranyl Transferase (GGTase-I) Chain A Protein Farnesyltransferase (PFT) Chain A Protein farnesyltransferase Protein farnesyltransferase/geranylgeranyltransferase type I alpha subunit | Ras proteins prenyltransferase alpha
Type:
Enzyme
Mol. Mass.:
44392.46
Organism:
Homo sapiens (Human)
Description:
Recombinant human FTase.
Residue:
379
  
Inhibitor
Name:
BDBM50289150
Synonyms:
Acetic acid (7E,11E)-(1S,2R,4R,14S,15R)-4,8,12-trimethyl-16-methylene-17-oxo-3,18-dioxa-tricyclo[13.3.0.0*2,4*]octadeca-7,11-dien-14-yl ester | CHEMBL354262
Type:
Small organic molecule
Emp. Form.:
C22H30O5
Mol. Mass.:
374.4706
SMILES:
CC(=O)O[C@H]1C\C(C)=C\CC\C(C)=C\CC[C@@]2(C)O[C@@H]2[C@H]2OC(=O)C(=C)[C@H]12
: