Target
MHC class II antigen
Ligand
BDBM50289277
Substrate
Meas. Tech.
ChEMBL_192854 (CHEMBL800187)
IC50
140±n/a nM
Citation
 Cunningham, BRRivetna, MTolman, RLFlattery, SJNichols, EASchwartz, CDWicker, LSHermes, JDJones, AB SAR for MHC class II binding tetrapeptides: Correlation with potential binding site Bioorg Med Chem Lett 7:19-24 (1997)    Article 
Target
Name:
MHC class II antigen
Synonyms:
DR-1 HLA class II histocompatibility antigen DRB1-1 Human leukocyte antigen DR beta chain | MHC class I antigen DRB1*1
Type:
PROTEIN
Mol. Mass.:
29917.79
Organism:
Homo sapiens (Human)
Description:
ChEMBL_192854
Residue:
266
  
Inhibitor
Name:
BDBM50289277
Synonyms:
(S)-4-Methyl-2-{(S)-2-[(S)-3-methyl-2-((S)-2-pentanoylamino-3-phenyl-propionylamino)-butyrylamino]-propionylamino}-pentanoic acid amide | CHEMBL76898
Type:
Small organic molecule
Emp. Form.:
C28H45N5O5
Mol. Mass.:
531.6874
SMILES:
CCCCC(=O)N[C@@H](Cc1ccccc1)C(=O)N[C@@H](C(C)C)C(=O)N[C@@H](C)C(=O)N[C@@H](CC(C)C)C(N)=O
: