Target
MHC class II antigen
Ligand
BDBM50289287
Substrate
Meas. Tech.
ChEMBL_192854 (CHEMBL800187)
IC50
730±n/a nM
Citation
 Cunningham, BRRivetna, MTolman, RLFlattery, SJNichols, EASchwartz, CDWicker, LSHermes, JDJones, AB SAR for MHC class II binding tetrapeptides: Correlation with potential binding site Bioorg Med Chem Lett 7:19-24 (1997)    Article 
Target
Name:
MHC class II antigen
Synonyms:
DR-1 HLA class II histocompatibility antigen DRB1-1 Human leukocyte antigen DR beta chain | MHC class I antigen DRB1*1
Type:
PROTEIN
Mol. Mass.:
29917.79
Organism:
Homo sapiens (Human)
Description:
ChEMBL_192854
Residue:
266
  
Inhibitor
Name:
BDBM50289287
Synonyms:
((S)-1-{(S)-5-Amino-1-[(S)-1-(1-carbamoyl-cyclopentylcarbamoyl)-ethylcarbamoyl]-pentylcarbamoyl}-2-phenyl-ethyl)-carbamic acid ethyl ester | CHEMBL80965
Type:
Small organic molecule
Emp. Form.:
C27H42N6O6
Mol. Mass.:
546.659
SMILES:
CCOC(=O)N[C@@H](Cc1ccccc1)C(=O)N[C@@H](CCCCN)C(=O)N[C@@H](C)C(=O)NC1(CCCC1)C(N)=O
: