Target
MHC class II antigen
Ligand
BDBM50079824
Substrate
Meas. Tech.
ChEMBL_192854 (CHEMBL800187)
IC50
1.4±n/a nM
Citation
 Cunningham, BRRivetna, MTolman, RLFlattery, SJNichols, EASchwartz, CDWicker, LSHermes, JDJones, AB SAR for MHC class II binding tetrapeptides: Correlation with potential binding site Bioorg Med Chem Lett 7:19-24 (1997)    Article 
Target
Name:
MHC class II antigen
Synonyms:
DR-1 HLA class II histocompatibility antigen DRB1-1 Human leukocyte antigen DR beta chain | MHC class I antigen DRB1*1
Type:
PROTEIN
Mol. Mass.:
29917.79
Organism:
Homo sapiens (Human)
Description:
ChEMBL_192854
Residue:
266
  
Inhibitor
Name:
BDBM50079824
Synonyms:
((S)-1-{(S)-1-[(S)-(S)-1-(1-Carbamoyl-3-methyl-butylcarbamoyl)-butylcarbamoyl]-4-guanidino-butylcarbamoyl}-2-phenyl-ethyl)-carbamic acid ethyl ester CHEMBL292340
Type:
Small organic molecule
Emp. Form.:
C29H48N8O6
Mol. Mass.:
604.7414
SMILES:
CCC[C@H](NC(=O)[C@H](CCCNC(N)=N)NC(=O)[C@H](Cc1ccccc1)NC(=O)OCC)C(=O)N[C@@H](CC(C)C)C(N)=O
: