Target
MHC class II antigen
Ligand
BDBM50289252
Substrate
Meas. Tech.
ChEMBL_192856 (CHEMBL799390)
IC50
290±n/a nM
Citation
 Cunningham, BRRivetna, MTolman, RLFlattery, SJNichols, EASchwartz, CDWicker, LSHermes, JDJones, AB SAR for MHC class II binding tetrapeptides: Correlation with potential binding site Bioorg Med Chem Lett 7:19-24 (1997)    Article 
Target
Name:
MHC class II antigen
Synonyms:
DR-1 HLA class II histocompatibility antigen DRB1-1 Human leukocyte antigen DR beta chain | MHC class I antigen DRB1*1
Type:
PROTEIN
Mol. Mass.:
29917.79
Organism:
Homo sapiens (Human)
Description:
ChEMBL_192854
Residue:
266
  
Inhibitor
Name:
BDBM50289252
Synonyms:
(S)-2-((S)-2-{(S)-2-[(S)-2-(3-Ethyl-ureido)-3-phenyl-propionylamino]-3-methyl-butyrylamino}-propionylamino)-4-methyl-pentanoic acid amide | CHEMBL81463
Type:
Small organic molecule
Emp. Form.:
C26H42N6O5
Mol. Mass.:
518.6489
SMILES:
CCNC(=O)N[C@@H](Cc1ccccc1)C(=O)N[C@@H](C(C)C)C(=O)N[C@@H](C)C(=O)N[C@@H](CC(C)C)C(N)=O
: