Target
MHC class II antigen
Ligand
BDBM50289260
Substrate
Meas. Tech.
ChEBML_192856
IC50
1000±n/a nM
Citation
 Cunningham, BRRivetna, MTolman, RLFlattery, SJNichols, EASchwartz, CDWicker, LSHermes, JDJones, AB SAR for MHC class II binding tetrapeptides: Correlation with potential binding site Bioorg Med Chem Lett 7:19-24 (1997)    Article 
Target
Name:
MHC class II antigen
Synonyms:
DR-1 HLA class II histocompatibility antigen DRB1-1 Human leukocyte antigen DR beta chain | MHC class I antigen DRB1*1
Type:
PROTEIN
Mol. Mass.:
29917.79
Organism:
Homo sapiens (Human)
Description:
ChEMBL_192854
Residue:
266
  
Inhibitor
Name:
BDBM50289260
Synonyms:
(S)-4-Methyl-2-((S)-2-{(S)-3-methyl-2-[(S)-3-phenyl-2-(toluene-4-sulfonylamino)-propionylamino]-butyrylamino}-propionylamino)-pentanoic acid amide | CHEMBL79025
Type:
Small organic molecule
Emp. Form.:
C30H43N5O6S
Mol. Mass.:
601.757
SMILES:
CC(C)C[C@H](NC(=O)[C@H](C)NC(=O)[C@@H](NC(=O)[C@H](Cc1ccccc1)NS(=O)(=O)c1ccc(C)cc1)C(C)C)C(N)=O
: