Target
MHC class II antigen
Ligand
BDBM50289276
Substrate
Meas. Tech.
ChEMBL_192854 (CHEMBL800187)
IC50
12±n/a nM
Citation
 Cunningham, BRRivetna, MTolman, RLFlattery, SJNichols, EASchwartz, CDWicker, LSHermes, JDJones, AB SAR for MHC class II binding tetrapeptides: Correlation with potential binding site Bioorg Med Chem Lett 7:19-24 (1997)    Article 
Target
Name:
MHC class II antigen
Synonyms:
DR-1 HLA class II histocompatibility antigen DRB1-1 Human leukocyte antigen DR beta chain | MHC class I antigen DRB1*1
Type:
PROTEIN
Mol. Mass.:
29917.79
Organism:
Homo sapiens (Human)
Description:
ChEMBL_192854
Residue:
266
  
Inhibitor
Name:
BDBM50289276
Synonyms:
(1-{2-Methyl-1-[1-(2-oxo-azepan-3-ylcarbamoyl)-ethylcarbamoyl]-propylcarbamoyl}-2-phenyl-ethyl)-carbamic acid ethyl ester | CHEMBL311245
Type:
Small organic molecule
Emp. Form.:
C26H39N5O6
Mol. Mass.:
517.6178
SMILES:
CCOC(=O)N[C@@H](Cc1ccccc1)C(=O)N[C@@H](C(C)C)C(=O)N[C@@H](C)C(=O)N[C@H]1CCCCNC1=O
: