Target
Prothrombin
Ligand
BDBM50056772
Substrate
Meas. Tech.
ChEBML_208361
Ki
0.090000±n/a nM
Citation
 Lyle, TAChen, ZAppleby, SDFreidinger, RMGardell, SJLewis, SDLi, YLyle, EALynch, JJMulichak, AMNg, ASNaylor-Olsen, AMSanders, WM Synthesis, evaluation, and crystallographic analysis of L-371,912: A potent and selective active-site thrombin inhibitor Bioorg Med Chem Lett 7:67-72 (1997)    Article 
Target
Name:
Prothrombin
Synonyms:
Activation peptide fragment 1 Coagulation factor II Prothrombin precursor Thrombin heavy chain | Thrombin light chain
Type:
Protein
Mol. Mass.:
70029.57
Organism:
Homo sapiens (Human)
Description:
P00734
Residue:
622
  
Inhibitor
Name:
BDBM50056772
Synonyms:
(S)-1-((R)-2-Methylamino-3-phenyl-propionyl)-pyrrolidine-2-carboxylic acid [(S)-1-(4-amino-cyclohexyl)-2-methylcarbamoyl-2-oxo-ethyl]-amide L-370518
Type:
Small organic molecule
Emp. Form.:
C25H37N5O4
Mol. Mass.:
471.5924
SMILES:
CN[C@H](Cc1ccccc1)C(=O)N1CCC[C@H]1C(=O)N[C@@H](C1CCC(N)CC1)C(=O)C(=O)NC
: