Target
Prothrombin
Ligand
BDBM50289581
Substrate
Meas. Tech.
ChEBML_208719
Ki
4.9±n/a nM
Citation
 Quan, MLWityak, JDominguez, CDuncia, JVKettner, CAEllis, CDLiauw, AYPark, JMSantella, JBKnabb, RMThoolen, MJWeber, PCWexler, RR Biaryl substituted alkylboronate esters as thrombin inhibitors Bioorg Med Chem Lett 7:1595-1600 (1997)    Article 
Target
Name:
Prothrombin
Synonyms:
Activation peptide fragment 1 Coagulation factor II Prothrombin precursor Thrombin heavy chain | Thrombin light chain
Type:
Protein
Mol. Mass.:
70029.57
Organism:
Homo sapiens (Human)
Description:
P00734
Residue:
622
  
Inhibitor
Name:
BDBM50289581
Synonyms:
2-Nitro-biphenyl-4-carboxylic acid [(R)-4-guanidino-1-((2S,6R)-2,9,9-trimethyl-3,5-dioxa-4-bora-tricyclo[6.1.1.0*2,6*]dec-4-yl)-butyl]-amide | CHEMBL263204
Type:
Small organic molecule
Emp. Form.:
C28H36BN5O5
Mol. Mass.:
533.427
SMILES:
CC1(C)C2CC1C1(C)OB(OC1C2)C(CCC[N-]C(N)=[NH2+])NC(=O)c1ccc(-c2ccccc2)c(c1)[N+]([O-])=O
: