Target
Prothrombin
Ligand
BDBM50289594
Substrate
Meas. Tech.
ChEBML_208719
Ki
6.9±n/a nM
Citation
 Quan, MLWityak, JDominguez, CDuncia, JVKettner, CAEllis, CDLiauw, AYPark, JMSantella, JBKnabb, RMThoolen, MJWeber, PCWexler, RR Biaryl substituted alkylboronate esters as thrombin inhibitors Bioorg Med Chem Lett 7:1595-1600 (1997)    Article 
Target
Name:
Prothrombin
Synonyms:
Activation peptide fragment 1 Coagulation factor II Prothrombin precursor Thrombin heavy chain | Thrombin light chain
Type:
Protein
Mol. Mass.:
70029.57
Organism:
Homo sapiens (Human)
Description:
P00734
Residue:
622
  
Inhibitor
Name:
BDBM50289594
Synonyms:
2-Biphenyl-4-yl-N-[(R)-4-guanidino-1-((2S,6R)-2,9,9-trimethyl-3,5-dioxa-4-bora-tricyclo[6.1.1.0*2,6*]dec-4-yl)-butyl]-acetamide | CHEMBL434971
Type:
Small organic molecule
Emp. Form.:
C29H39BN4O3
Mol. Mass.:
502.456
SMILES:
CC1(C)C2CC1[C@]1(C)OB(O[C@@H]1C2)[C@H](CCCNC(N)=N)NC(=O)Cc1ccc(cc1)-c1ccccc1
: