Target
Serine protease 1
Ligand
BDBM50289582
Substrate
Meas. Tech.
ChEBML_210656
Ki
0.640000±n/a nM
Citation
 Quan, MLWityak, JDominguez, CDuncia, JVKettner, CAEllis, CDLiauw, AYPark, JMSantella, JBKnabb, RMThoolen, MJWeber, PCWexler, RR Biaryl substituted alkylboronate esters as thrombin inhibitors Bioorg Med Chem Lett 7:1595-1600 (1997)    Article 
Target
Name:
Serine protease 1
Synonyms:
Alpha-trypsin chain 1 Beta-trypsin PRSS1 TRP1 TRY1_HUMAN Thrombin & trypsin Trypsin I | Trypsin-1
Type:
Enzyme
Mol. Mass.:
26557.80
Organism:
Homo sapiens (Human)
Description:
P07477
Residue:
247
  
Inhibitor
Name:
BDBM50289582
Synonyms:
3-Methyl-2'-methylsulfonylcarbamate-biphenyl-4-carboxylic acid [4-guanidino-1-(2,9,9-trimethyl-3,5-dioxa-4-bora-tricyclo[6.1.1.0*2,6*]dec-4-yl)-butyl]-amide | CHEMBL287964
Type:
Small organic molecule
Emp. Form.:
C31H42BN5O7S
Mol. Mass.:
639.57
SMILES:
COC(=O)NS(=O)(=O)c1ccccc1-c1ccc(C(=O)N[C@@H](CCCNC(N)=N)B2O[C@@H]3CC4CC(C4(C)C)[C@]3(C)O2)c(C)c1
: