Target
Serine protease 1
Ligand
BDBM50289587
Substrate
Meas. Tech.
ChEBML_210656
Ki
4.2±n/a nM
Citation
 Quan, MLWityak, JDominguez, CDuncia, JVKettner, CAEllis, CDLiauw, AYPark, JMSantella, JBKnabb, RMThoolen, MJWeber, PCWexler, RR Biaryl substituted alkylboronate esters as thrombin inhibitors Bioorg Med Chem Lett 7:1595-1600 (1997)    Article 
Target
Name:
Serine protease 1
Synonyms:
Alpha-trypsin chain 1 Beta-trypsin PRSS1 TRP1 TRY1_HUMAN Thrombin & trypsin Trypsin I | Trypsin-1
Type:
Enzyme
Mol. Mass.:
26557.80
Organism:
Homo sapiens (Human)
Description:
P07477
Residue:
247
  
Inhibitor
Name:
BDBM50289587
Synonyms:
3-Methyl-biphenyl-4-carboxylic acid [(R)-4-guanidino-1-((2S,6R)-2,9,9-trimethyl-3,5-dioxa-4-bora-tricyclo[6.1.1.0*2,6*]dec-4-yl)-butyl]-amide | CHEMBL289318
Type:
Small organic molecule
Emp. Form.:
C29H39BN4O3
Mol. Mass.:
502.456
SMILES:
Cc1cc(ccc1C(=O)N[C@@H](CCCNC(N)=N)B1O[C@@H]2CC3CC(C3(C)C)[C@]2(C)O1)-c1ccccc1
: