Target
Receptor-type tyrosine-protein phosphatase C
Ligand
BDBM50289995
Substrate
Meas. Tech.
ChEMBL_39930 (CHEMBL856085)
IC50
8000±n/a nM
Citation
 Frechette, RFAckerman, CBeers, SLook, RMoore, J Novel hydroxyphosphonate inhibitors of CD-45 tyrosine phosphatase Bioorg Med Chem Lett 7:2169-2172 (1997)    Article 
Target
Name:
Receptor-type tyrosine-protein phosphatase C
Synonyms:
CD45 L-CA PTPRC Receptor-type tyrosine-protein phosphatase C (CD45) | T200
Type:
Protein
Mol. Mass.:
147474.19
Organism:
Homo sapiens (Human)
Description:
P08575
Residue:
1306
  
Inhibitor
Name:
BDBM50289995
Synonyms:
CHEMBL305414 | [(2-Azido-5-nitro-phenyl)-hydroxy-methyl]-phosphonic acid
Type:
Small organic molecule
Emp. Form.:
C7H7N4O6P
Mol. Mass.:
274.1274
SMILES:
OP(O)(O)C(=O)c1cc(ccc1N=[N+]=[N-])[N+]([O-])=O
: