Target
Adenosine receptor A2a
Ligand
BDBM50047184
Substrate
Meas. Tech.
ChEMBL_30920 (CHEMBL647730)
Ki
2.4±n/a nM
Citation
 Shimada, JKoike, NNonaka, HShiozaki, SYanagawa, KKanda, TKobayashi, HIchimura, MNakamura, JKase, HSuzuki, F Adenosine A2A antagonists with potent anti-cataleptic activity Bioorg Med Chem Lett 7:2349-2352 (1997)    Article 
Target
Name:
Adenosine receptor A2a
Synonyms:
AA2AR_RAT Adenosine A2 receptor Adenosine Receptors A2a (A2a) Adenosine receptors A2a Rat striatal adenosine A2a receptor
Type:
G Protein-Coupled Receptor (GPCR)
Mol. Mass.:
45015.65
Organism:
Rattus norvegicus (rat)
Description:
Rat A2A receptors expressed in CHO cells.
Residue:
410
  
Inhibitor
Name:
BDBM50047184
Synonyms:
1,3-Diethyl-7-methyl-8-[(E)-2-(3,4,5-trimethoxy-phenyl)-vinyl]-3,7-dihydro-purine-2,6-dione CHEMBL422399
Type:
Small organic molecule
Emp. Form.:
C21H26N4O5
Mol. Mass.:
414.4549
SMILES:
CCn1c2nc(\C=C\c3cc(OC)c(OC)c(OC)c3)n(C)c2c(=O)n(CC)c1=O
: