Target
Melatonin receptor type 1A
Ligand
BDBM29611
Substrate
Meas. Tech.
ChEBML_105103
Ki
0.080±n/a nM
Citation
 Li, PKChu, GHGillen, MLParekh, TWitt-Enderby, PA The development of a charged melatonin receptor ligand Bioorg Med Chem Lett 7:2409-2414 (1997)    Article 
Target
Name:
Melatonin receptor type 1A
Synonyms:
MTNR1A MTR1A_HUMAN Mel1a melatonin receptor Melatonin receptor Melatonin receptor type 1 (MT1) | Melatonin receptor type 1A
Type:
Enzyme
Mol. Mass.:
39392.94
Organism:
Homo sapiens (Human)
Description:
P48039
Residue:
350
  
Inhibitor
Name:
BDBM29611
Synonyms:
2-Iodomelatonin Melatonin,2-Iodo
Type:
Small organic molecule
Emp. Form.:
C13H15IN2O2
Mol. Mass.:
358.1749
SMILES:
COc1ccc2[nH]c(I)c(CCNC(C)=O)c2c1
: