Target
Neuronal acetylcholine receptor subunit alpha-4/beta-2
Ligand
BDBM50049756
Substrate
Meas. Tech.
ChEMBL_217302 (CHEMBL823923)
EC50
750±n/a nM
Citation
 Elliott, RLRyther, KBAnderson, DJPiattoni-Kaplan, MKuntzweiler, TADonnelly-Roberts, DArneric, SPHolladay, MW Novel 2-(2′-furo[3,2-b]pyridinyl) pyrrolidines: potent neuronal nicotinic acetylcholine receptor ligands Bioorg Med Chem Lett 7:2703-2708 (1997)    Article 
Target
Name:
Neuronal acetylcholine receptor subunit alpha-4/beta-2
Synonyms:
Neuronal acetylcholine receptor Alpha-4/Beta-2 Neuronal acetylcholine receptor; alpha4/beta2 | nAChR subtypes alpha4 beta2
Type:
Protein
Mol. Mass.:
Description:
Components:
This complex has 2 components.
Component 1
Name:
Neuronal acetylcholine receptor subunit alpha-4
Synonyms:
ACHA4_HUMAN CHRNA4 protein Neuronal acetylcholine receptor protein alpha-4 subunit Nicotinic acetylcholine receptor alpha4/beta2/alpha5
Type:
Mol. Mass.:
69963.49
Organism:
Homo sapiens (Human)
Description:
NACHRA4
Residue:
627
  
Component 2
Name:
Neuronal acetylcholine receptor subunit beta-2
Synonyms:
ACHB2_HUMAN Neuronal acetylcholine receptor protein beta-2 subunit | Nicotinic acetylcholine receptor alpha3/beta2/alpha5
Type:
Protein
Mol. Mass.:
57020.50
Organism:
Homo sapiens (Human)
Description:
P17787
Residue:
502
  
Inhibitor
Name:
BDBM50049756
Synonyms:
3-((S)-1-Methyl-pyrrolidin-2-ylmethoxy)-pyridine CHEMBL84149
Type:
Small organic molecule
Emp. Form.:
C11H16N2O
Mol. Mass.:
192.2575
SMILES:
CN1CCC[C@H]1COc1cccnc1
: