Target
Platelet-derived growth factor receptor beta
Ligand
BDBM3032
Substrate
Meas. Tech.
ChEBML_177425
IC50
21900±n/a nM
Citation
 Kubo, KShimizu, TOhyama, SiMurooka, HNishitoba, TKato, SKobayashi, YYagi, MIsoe, TNakamura, KOsawa, TIzawa, T A novel series of 4-phenoxyquinolines: potent and highly selective inhibitors of PDGF receptor autophosphorylation Bioorg Med Chem Lett 7:2935-2940 (1997)    Article 
Target
Name:
Platelet-derived growth factor receptor beta
Synonyms:
Beta-type platelet-derived growth factor receptor CD_antigen=CD140b PGFRB_RAT Pdgfr1 Platelet-derived growth factor receptor (PDGFr) Platelet-derived growth factor receptor beta (PDGFRB)
Type:
PROTEIN
Mol. Mass.:
122794.58
Organism:
Rattus norvegicus
Description:
ChEMBL_177425
Residue:
1097
  
Inhibitor
Name:
BDBM3032
Synonyms:
CHEMBL1204168 N-(3-bromophenyl)-6,7-dimethoxyquinazolin-4-amine US11001595, Compound PD153035 US9422297, PD153035
Type:
Small organic molecule
Emp. Form.:
C16H14BrN3O2
Mol. Mass.:
360.205
SMILES:
COc1cc2ncnc(Nc3cccc(Br)c3)c2cc1OC
: