Target
Platelet-derived growth factor receptor beta
Ligand
BDBM50290853
Substrate
Meas. Tech.
ChEBML_177425
IC50
760±n/a nM
Citation
 Kubo, KShimizu, TOhyama, SiMurooka, HNishitoba, TKato, SKobayashi, YYagi, MIsoe, TNakamura, KOsawa, TIzawa, T A novel series of 4-phenoxyquinolines: potent and highly selective inhibitors of PDGF receptor autophosphorylation Bioorg Med Chem Lett 7:2935-2940 (1997)    Article 
Target
Name:
Platelet-derived growth factor receptor beta
Synonyms:
Beta-type platelet-derived growth factor receptor CD_antigen=CD140b PGFRB_RAT Pdgfr1 Platelet-derived growth factor receptor (PDGFr) Platelet-derived growth factor receptor beta (PDGFRB)
Type:
PROTEIN
Mol. Mass.:
122794.58
Organism:
Rattus norvegicus
Description:
ChEMBL_177425
Residue:
1097
  
Inhibitor
Name:
BDBM50290853
Synonyms:
6,7-Dimethoxy-4-phenoxy-quinoline | CHEMBL327534
Type:
Small organic molecule
Emp. Form.:
C17H15NO3
Mol. Mass.:
281.3059
SMILES:
COc1cc2nccc(Oc3ccccc3)c2cc1OC
: