Target
Lysosomal alpha-glucosidase
Ligand
BDBM50291027
Substrate
Meas. Tech.
ChEBML_34405
Ki
2600±n/a nM
Citation
 Lesur, BDucep, JBLalloz, MNEhrhard, ADanzin, C New deoxynojirimycin derivatives as potent inhibitors of intestinal α-glucohydrolases Bioorg Med Chem Lett 7:355-360 (1997)    Article 
Target
Name:
Lysosomal alpha-glucosidase
Synonyms:
70 kDa lysosomal alpha-glucosidase Acid maltase Alpha glucosidase LYAG_HUMAN
Type:
PROTEIN
Mol. Mass.:
105312.45
Organism:
Homo sapiens (Human)
Description:
ChEMBL_1506060
Residue:
952
  
Inhibitor
Name:
BDBM50291027
Synonyms:
(2R,3R,4R,5S)-2-Hydroxymethyl-1-(4-trimethylsilanyl-benzyl)-piperidine-3,4,5-triol | CHEMBL332802
Type:
Small organic molecule
Emp. Form.:
C16H27NO4Si
Mol. Mass.:
325.4754
SMILES:
C[Si](C)(C)c1ccc(CN2C[C@H](O)[C@@H](O)[C@H](O)[C@H]2CO)cc1
: