Target
Gag-Pol polyprotein [489-587]
Ligand
BDBM767
Substrate
Meas. Tech.
ChEBML_157558
Ki
0.800000±n/a nM
Citation
 Schwartz, TMBundy, GLStrohbach, JWThaisrivongs, SJohnson, PDSkulnick, HITomich, PKLynn, JCChong, KTHinshaw, RRRaub, TJPadbury, GEToth, LN Synthesis and pharmacological evaluation of sulfone substituted HIV protease inhibitors Bioorg Med Chem Lett 7:399-402 (1997)    Article 
Target
Name:
Gag-Pol polyprotein [489-587]
Synonyms:
Human immunodeficiency virus type 1 protease Pol polyprotein | gag-pol
Type:
Enzyme Subunit
Mol. Mass.:
10781.16
Organism:
Human immunodeficiency virus type 1
Description:
P04585[489-587]
Residue:
99
  
Inhibitor
Name:
BDBM767
Synonyms:
4-Cyano-N-[3-[cyclopropyl(5,6,7,8,9,10-hexahydro-4-hydroxy-2-oxo-2H-cycloocta[b]pyran-3-yl)methyl]phenyl]-benzenesulfonamide U-103,017
Type:
Small organic molecule
Emp. Form.:
C28H28N2O5S
Mol. Mass.:
504.597
SMILES:
Oc1c2CCCCCCc2oc(=O)c1[C@@H](C1CC1)c1cccc(NS(=O)(=O)c2ccc(cc2)C#N)c1
: