Target
Gag-Pol polyprotein [489-587]
Ligand
BDBM50291063
Substrate
Meas. Tech.
ChEBML_157558
Ki
1.1±n/a nM
Citation
 Schwartz, TMBundy, GLStrohbach, JWThaisrivongs, SJohnson, PDSkulnick, HITomich, PKLynn, JCChong, KTHinshaw, RRRaub, TJPadbury, GEToth, LN Synthesis and pharmacological evaluation of sulfone substituted HIV protease inhibitors Bioorg Med Chem Lett 7:399-402 (1997)    Article 
Target
Name:
Gag-Pol polyprotein [489-587]
Synonyms:
Human immunodeficiency virus type 1 protease Pol polyprotein | gag-pol
Type:
Enzyme Subunit
Mol. Mass.:
10781.16
Organism:
Human immunodeficiency virus type 1
Description:
P04585[489-587]
Residue:
99
  
Inhibitor
Name:
BDBM50291063
Synonyms:
1-Methyl-1H-imidazole-2-sulfonic acid {3-[cyclopropyl-(4-hydroxy-2-oxo-5,6,7,8,9,10-hexahydro-2H-cycloocta[b]pyran-3-yl)-methyl]-phenyl}-amide | CHEMBL132275
Type:
Small organic molecule
Emp. Form.:
C25H29N3O5S
Mol. Mass.:
483.58
SMILES:
Cn1ccnc1S(=O)(=O)Nc1cccc(c1)C(C1CC1)c1c(O)c2CCCCCCc2oc1=O
: