Target
DNA topoisomerase 1
Ligand
BDBM50291414
Substrate
Meas. Tech.
ChEBML_208416
IC50
>100000±n/a nM
Citation
 Candiani, IBedeschi, ACabri, WZarini, FVisentin, GCapolongo, LGeroni, CCiomei, M Synthesis and cytotoxic activity of alkylidene- and alkyl-substituted camptothecins Bioorg Med Chem Lett 7:847-850 (1997)    Article 
Target
Name:
DNA topoisomerase 1
Synonyms:
DNA topoisomerase I TOP1 | TOP1_HUMAN
Type:
Enzyme
Mol. Mass.:
90771.02
Organism:
Homo sapiens (Human)
Description:
P11387
Residue:
765
  
Inhibitor
Name:
BDBM50291414
Synonyms:
(S)-4-Ethyl-4-hydroxy-10-phenethyl-1,12-dihydro-4H-2-oxa-6,12a-diaza-dibenzo[b,h]fluorene-3,13-dione | CHEMBL352709
Type:
Small organic molecule
Emp. Form.:
C28H24N2O4
Mol. Mass.:
452.5012
SMILES:
CC[C@@]1(O)C(=O)OCc2c1cc1-c3nc4cccc(CCc5ccccc5)c4cc3Cn1c2=O
: