Target
Neuronal acetylcholine receptor subunit alpha-7
Ligand
BDBM50194071
Substrate
Meas. Tech.
ChEMBL_303577 (CHEMBL828976)
Ki
3300±n/a nM
Citation
 Carroll, FI Corrigendum to Epibatidine structureactivity relationships Bioorg Med Chem Lett 14:5713-5713 (2004)    Article 
Target
Name:
Neuronal acetylcholine receptor subunit alpha-7
Synonyms:
ACHA7_RAT Cholinergic, Nicotinic Alpha7 Chrna7 Neuronal acetylcholine receptor (alpha7 nAChR) Neuronal acetylcholine receptor subunit alpha-7 Neuronal acetylcholine receptor subunit alpha-7 (nAChR)
Type:
Enzyme
Mol. Mass.:
56502.44
Organism:
Rattus norvegicus (Rat)
Description:
Q05941
Residue:
502
  
Inhibitor
Name:
BDBM50194071
Synonyms:
3-(6-chloropyridin-3-yl)-6-aza-bicyclo[2.2.1]heptane CHEMBL363973
Type:
Small organic molecule
Emp. Form.:
C11H13ClN2
Mol. Mass.:
208.687
SMILES:
Clc1ccc(cn1)C1CC2CC1CN2
: