Target
Tyrosine-protein kinase Lck
Ligand
BDBM50011438
Substrate
Meas. Tech.
ChEMBL_506203 (CHEMBL941407)
IC50
100000±n/a nM
Citation
 Chang, CJGeahlen, RL Protein-Tyrosine Kinase Inhibition: Mechanism-Based Discovery of Antitumor Agents J Nat Prod 55:1529-1560 (1992)  
Target
Name:
Tyrosine-protein kinase Lck
Synonyms:
2.7.10.2 LCK_HUMAN Leukocyte C-terminal Src kinase Lymphocyte-specific protein tyrosine kinase Protein YT16 Proto-oncogene tyrosine-protein kinase LCK T cell-specific protein-tyrosine kinase
Type:
Mol. Mass.:
57987.83
Organism:
Homo sapiens (Human)
Description:
P06239
Residue:
509
  
Inhibitor
Name:
BDBM50011438
Synonyms:
2-(4-Amino-phenyl)-7-hydroxy-chromen-4-one 7-Hydroxy-flavone, 6 | CHEMBL165751
Type:
Small organic molecule
Emp. Form.:
C15H11NO3
Mol. Mass.:
253.2527
SMILES:
Nc1ccc(cc1)-c1cc(=O)c2ccc(O)cc2o1
: