Target
Epidermal growth factor receptor
Ligand
BDBM50292520
Substrate
Meas. Tech.
ChEMBL_506200 (CHEMBL941404)
IC50
10000±n/a nM
Citation
 Chang, CJGeahlen, RL Protein-Tyrosine Kinase Inhibition: Mechanism-Based Discovery of Antitumor Agents J Nat Prod 55:1529-1560 (1992)  
Target
Name:
Epidermal growth factor receptor
Synonyms:
EGF Receptor Substrate EGFR_HUMAN ERBB1 Epidermal Growth Factor Receptor erbB-1 Epidermal growth factor receptor (EGFR) HER1 Proto-oncogene c-ErbB-1 Tyrosine-Protein Kinase ErbB-1
Type:
Receptor Kinase Domain
Mol. Mass.:
134279.59
Organism:
Homo sapiens (Human)
Description:
P00533
Residue:
1210
  
Inhibitor
Name:
BDBM50292520
Synonyms:
CHEMBL520493 | N-(2-chlorophenyl)-2-cyano-3-(3,4-dihydroxyphenyl)acrylamide
Type:
Small organic molecule
Emp. Form.:
C16H11ClN2O3
Mol. Mass.:
314.723
SMILES:
Oc1ccc(\C=C(\C#N)C(=O)Nc2ccccc2Cl)cc1O
: