Target
Mu-type opioid receptor
Ligand
BDBM50292537
Substrate
Meas. Tech.
ChEMBL_482482 (CHEMBL956178)
IC50
3000±n/a nM
Citation
 Lewin, GMénez, PLRolland, YRenouard, AGiesen-Crouse, E Akuammine and Dihydroakuammine, Two Indolomonoterpene Alkaloids Displaying Affinity for Opioid Receptors J Nat Prod 55:380-384 (1992)  
Target
Name:
Mu-type opioid receptor
Synonyms:
MOR-1 Mu-type opioid receptor (MOR) OPRM_RAT Opioid receptor B Ror-b
Type:
G Protein-Coupled Receptor (GPCR)
Mol. Mass.:
44503.11
Organism:
Rattus norvegicus (rat)
Description:
Competition binding assays were carried out using membrane preparations from transfected HN9.10 cells that constitutively expressed the mu opioid receptor.
Residue:
398
  
Inhibitor
Name:
BDBM50292537
Synonyms:
CHEMBL484665 | akuammine
Type:
Small organic molecule
Emp. Form.:
C22H26N2O4
Mol. Mass.:
382.4528
SMILES:
COC(=O)[C@]12CO[C@]34[C@@H]5C[C@@H]1\C(CN5CC[C@]23c1cc(O)ccc1N4C)=C/C
: