Target
Angiotensin-converting enzyme
Ligand
BDBM50292546
Substrate
Meas. Tech.
ChEMBL_483399 (CHEMBL964324)
Ki
126000±n/a nM
Citation
 Chen, CHLin, JYLin, CNHsu, SY Inhibition of Angiotensin-I-Converting Enzyme by Tetrahydroxyxanthones Isolated from Tripterospermum lanceolatum J Nat Prod 55:691-695 (1992)  
Target
Name:
Angiotensin-converting enzyme
Synonyms:
ACE Angiotensin converting enzyme (ACE) Angiotensin-converting enzyme, soluble form CD_antigen=CD143 DCP1 Kininase II
Type:
Enzyme
Mol. Mass.:
149709.01
Organism:
Homo sapiens (Human)
Description:
Residue:
1306
  
Inhibitor
Name:
BDBM50292546
Synonyms:
3,4,5,6-tetrahydroxyxanthone US9114126, MB7
Type:
Small organic molecule
Emp. Form.:
C13H8O6
Mol. Mass.:
260.199
SMILES:
Oc1ccc2c(oc3c(O)c(O)ccc3c2=O)c1O
: