Target
D(1A) dopamine receptor
Ligand
BDBM50292548
Substrate
Meas. Tech.
ChEMBL_483725 (CHEMBL997480)
IC50
5600±n/a nM
Citation
 Cortes, DFigadere, BSaez, JProtais, P Displacement Activity of Bisbenzylisoquinoline Alkaloids at Striatal 3H-SCH 23390 and 3H-Raclopride Binding Sites J Nat Prod 55:1281-1286 (1992)  
Target
Name:
D(1A) dopamine receptor
Synonyms:
DOPAMINE D1 Dopamine D1 high Dopamine receptor Dopamine1-like Drd1a
Type:
Enzyme Catalytic Domain
Mol. Mass.:
49429.75
Organism:
RAT
Description:
P18901
Residue:
446
  
Inhibitor
Name:
BDBM50292548
Synonyms:
(+)-(1R,1'S)-thaligrisine hydrochloride | CHEMBL451734
Type:
Small organic molecule
Emp. Form.:
C37H42N2O6
Mol. Mass.:
610.7392
SMILES:
COc1cc2CCN(C)[C@@H](Cc3ccc(Oc4cc(C[C@H]5N(C)CCc6cc(OC)c(O)cc56)ccc4OC)cc3)c2cc1O
: