Target
D(1A) dopamine receptor
Ligand
BDBM50292556
Substrate
Meas. Tech.
ChEMBL_483725 (CHEMBL997480)
IC50
11100±n/a nM
Citation
 Cortes, DFigadere, BSaez, JProtais, P Displacement Activity of Bisbenzylisoquinoline Alkaloids at Striatal 3H-SCH 23390 and 3H-Raclopride Binding Sites J Nat Prod 55:1281-1286 (1992)  
Target
Name:
D(1A) dopamine receptor
Synonyms:
DOPAMINE D1 Dopamine D1 high Dopamine receptor Dopamine1-like Drd1a
Type:
Enzyme Catalytic Domain
Mol. Mass.:
49429.75
Organism:
RAT
Description:
P18901
Residue:
446
  
Inhibitor
Name:
BDBM50292556
Synonyms:
(S,S)-oxandrine hydrochloride | CHEMBL445011
Type:
Small organic molecule
Emp. Form.:
C37H38N2O7
Mol. Mass.:
622.7068
SMILES:
COc1cc2CCN(C)[C@H]3Cc4ccc(OC)c(c4)-c4cc(ccc4O)C(=O)[C@H]4N(C)CCc5cc(OC)c(Oc(c1O)c23)cc45
: