Target
Disintegrin and metalloproteinase domain-containing protein 10
Ligand
BDBM26524
Substrate
Meas. Tech.
ChEMBL_496902 (CHEMBL1001997)
Ki
>10000000±n/a nM
Citation
 Mazzola, RDZhu, ZSinning, LMcKittrick, BLavey, BSpitler, JKozlowski, JNeng-Yang, SZhou, GGuo, ZOrth, PMadison, VSun, JLundell, DNiu, X Discovery of novel hydroxamates as highly potent tumor necrosis factor-alpha converting enzyme inhibitors. Part II: optimization of the S3' pocket. Bioorg Med Chem Lett 18:5809-14 (2009)  
Target
Name:
Disintegrin and metalloproteinase domain-containing protein 10
Synonyms:
ADA10_HUMAN Disintegrin and metalloproteinase domain-containing protein 10 (ADAM10) MADM
Type:
Enzyme
Mol. Mass.:
84160.93
Organism:
Homo sapiens (Human)
Description:
O14672
Residue:
748
  
Inhibitor
Name:
BDBM26524
Synonyms:
(1R,2S)-1-({3-fluoro-4-[(2-phenylquinolin-4-yl)methoxy]phenyl}methyl)-2-N-hydroxycyclopropane-1,2-dicarboxamide | hydroxamate-cyclopropyl compound, 1
Type:
Small organic molecule
Emp. Form.:
C28H24FN3O4
Mol. Mass.:
485.5063
SMILES:
NC(=O)[C@@]1(Cc2ccc(OCc3cc(nc4ccccc34)-c3ccccc3)c(F)c2)C[C@@H]1C(=O)NO
: