Target
Disintegrin and metalloproteinase domain-containing protein 10
Ligand
BDBM23487
Substrate
Meas. Tech.
ChEMBL_496902 (CHEMBL1001997)
Ki
>10000000±n/a nM
Citation
 Mazzola, RDZhu, ZSinning, LMcKittrick, BLavey, BSpitler, JKozlowski, JNeng-Yang, SZhou, GGuo, ZOrth, PMadison, VSun, JLundell, DNiu, X Discovery of novel hydroxamates as highly potent tumor necrosis factor-alpha converting enzyme inhibitors. Part II: optimization of the S3' pocket. Bioorg Med Chem Lett 18:5809-14 (2009)  
Target
Name:
Disintegrin and metalloproteinase domain-containing protein 10
Synonyms:
ADA10_HUMAN Disintegrin and metalloproteinase domain-containing protein 10 (ADAM10) MADM
Type:
Enzyme
Mol. Mass.:
84160.93
Organism:
Homo sapiens (Human)
Description:
O14672
Residue:
748
  
Inhibitor
Name:
BDBM23487
Synonyms:
(1S,2R)-1-N-hydroxy-2-({4-[(2-methylquinolin-4-yl)methoxy]phenyl}methyl)cyclopropane-1,2-dicarboxamide hydroxamate deriv., 78
Type:
Small organic molecule
Emp. Form.:
C23H23N3O4
Mol. Mass.:
405.4464
SMILES:
Cc1cc(COc2ccc(C[C@@]3(C[C@@H]3C(=O)NO)C(N)=O)cc2)c2ccccc2n1
: