Target
Vesicular acetylcholine transporter
Ligand
BDBM50039613
Substrate
Meas. Tech.
ChEMBL_494628 (CHEMBL945287)
Ki
0.055000±n/a nM
Citation
 Tu, ZEfange, SMXu, JLi, SJones, LAParsons, SMMach, RH Synthesis and in vitro and in vivo evaluation of 18F-labeled positron emission tomography (PET) ligands for imaging the vesicular acetylcholine transporter. J Med Chem 52:1358-69 (2009)  
Target
Name:
Vesicular acetylcholine transporter
Synonyms:
SLC18A3 VACHT | VACHT_HUMAN
Type:
PROTEIN
Mol. Mass.:
56900.67
Organism:
Homo sapiens (Human)
Description:
ChEMBL_1507628
Residue:
532
  
Inhibitor
Name:
BDBM50039613
Synonyms:
(2R,3R)-3-(4-Phenyl-piperidin-1-yl)-1,2,3,4-tetrahydro-naphthalen-2-ol CHEMBL87379 | trans-3-(4-phenylpiperidin-1-yl)-1,2,3,4-tetrahydronaphthalen-2-ol
Type:
Small organic molecule
Emp. Form.:
C21H25NO
Mol. Mass.:
307.4293
SMILES:
O[C@@H]1Cc2ccccc2C[C@H]1N1CCC(CC1)c1ccccc1
: