Target
Glycogen synthase kinase-3 beta
Ligand
BDBM50293305
Substrate
Meas. Tech.
ChEMBL_570959 (CHEMBL1034478)
Ki
0.09±n/a nM
Citation
 Vadivelan, SSinha, BNTajne, SJagarlapudi, SA Fragment and knowledge-based design of selective GSK-3beta inhibitors using virtual screening models. Eur J Med Chem 44:2361-71 (2009)  
Target
Name:
Glycogen synthase kinase-3 beta
Synonyms:
GSK-3 beta GSK3B Glycogen synthase kinase 3 beta (GSK3B) Glycogen synthase kinase-3 beta (GSK-3B) Glycogen synthase kinase-3 beta (GSK3B) Glycogen synthase kinase-3beta (GSK3B) | Serine/threonine-protein kinase GSK3B
Type:
Enzyme
Mol. Mass.:
46756.38
Organism:
Homo sapiens (Human)
Description:
P49841
Residue:
420
  
Inhibitor
Name:
BDBM50293305
Synonyms:
4-(2,4-dichlorophenyl)-5-(1H-imidazol-2-yl)-N-(2-(5-nitropyridin-2-ylamino)ethyl)pyrimidin-2-amine CHIR-98023 N1-(4-(2,4-dichlorophenyl)-5-(1H-imidazol-2-yl)pyrimidin-2-yl)-N2-(5-nitropyridin-2-yl)ethane-1,2-diamine
Type:
Small organic molecule
Emp. Form.:
C20H16Cl2N8O2
Mol. Mass.:
471.299
SMILES:
[O-][N+](=O)c1ccc(NCCNc2ncc(-c3ncc[nH]3)c(n2)-c2ccc(Cl)cc2Cl)nc1
: