Target
Aurora kinase A
Ligand
BDBM50293679
Substrate
Meas. Tech.
ChEMBL_571639 (CHEMBL1031294)
Ki
3±n/a nM
Citation
 Bebbington, DBinch, HCharrier, JDEveritt, SFraysse, DGolec, JKay, DKnegtel, RMak, CMazzei, FMiller, AMortimore, MO'Donnell, MPatel, SPierard, FPinder, JPollard, JRamaya, SRobinson, DRutherford, AStudley, JWestcott, J The discovery of the potent aurora inhibitor MK-0457 (VX-680). Bioorg Med Chem Lett 19:3586-92 (2009)  
Target
Name:
Aurora kinase A
Synonyms:
AIK ARK1 AURKA AYK1 Aurora kinase A (AURA) Aurora kinase A (Aurora A) Aurora-related kinase 1 BTAK Breast-tumor-amplified kinase STK15 Serine/threonine kinase 15 Serine/threonine-protein kinase aurora A hARK1
Type:
Serine/threonine-protein kinase
Mol. Mass.:
45830.98
Organism:
Homo sapiens (Human)
Description:
O14965
Residue:
403
  
Inhibitor
Name:
BDBM50293679
Synonyms:
2-(2,3-dichlorophenylthio)-N-(5-methyl-1H-pyrazol-3-yl)quinazolin-4-amine | CHEMBL564459
Type:
Small organic molecule
Emp. Form.:
C18H13Cl2N5S
Mol. Mass.:
402.3
SMILES:
Cc1cc(Nc2nc(Sc3cccc(Cl)c3Cl)nc3ccccc23)[nH]n1
: