Target
Peroxisome proliferator-activated receptor alpha
Ligand
BDBM50293853
Substrate
Meas. Tech.
ChEMBL_572392 (CHEMBL1035293)
IC50
>15000±n/a nM
Citation
 Liu, WLiu, KWood, HBMcCann, MEDoebber, TWChang, CHAkiyama, TEEinstein, MBerger, JPMeinke, PT Discovery of a peroxisome proliferator activated receptor gamma (PPARgamma) modulator with balanced PPARalpha activity for the treatment of type 2 diabetes and dyslipidemia. J Med Chem 52:4443-53 (2009)  
Target
Name:
Peroxisome proliferator-activated receptor alpha
Synonyms:
NR1C1 PPAR PPAR-alpha PPARA_HUMAN Peroxisome proliferator-activated receptor | Peroxisome proliferator-activated receptor alpha (PPAR alpha)
Type:
Enzyme
Mol. Mass.:
52222.08
Organism:
Homo sapiens (Human)
Description:
Q07869
Residue:
468
  
Inhibitor
Name:
BDBM50293853
Synonyms:
2-[3-[[3-(4-Chlorobenzoyl)-2-methyl-6-(trifluoromethoxy)-1Hindol-1-yl]methyl]phenoxy]acetic Acid | CHEMBL559567
Type:
Small organic molecule
Emp. Form.:
C26H19ClF3NO5
Mol. Mass.:
517.881
SMILES:
Cc1c(C(=O)c2ccc(Cl)cc2)c2ccc(OC(F)(F)F)cc2n1Cc1cccc(OCC(O)=O)c1
: