Target
Peroxisome proliferator-activated receptor gamma
Ligand
BDBM50085042
Substrate
Meas. Tech.
ChEMBL_572391 (CHEMBL1035292)
IC50
>5000±n/a nM
Citation
 Liu, WLiu, KWood, HBMcCann, MEDoebber, TWChang, CHAkiyama, TEEinstein, MBerger, JPMeinke, PT Discovery of a peroxisome proliferator activated receptor gamma (PPARgamma) modulator with balanced PPARalpha activity for the treatment of type 2 diabetes and dyslipidemia. J Med Chem 52:4443-53 (2009)  
Target
Name:
Peroxisome proliferator-activated receptor gamma
Synonyms:
NR1C3 PPAR-gamma PPARG_HUMAN Peroxisome proliferator-activated receptor gamma (PPAR gamma) Peroxisome proliferator-activated receptor gamma (PPARĪ³) peroxisome proliferator-activated receptor gamma isoform 2
Type:
Nuclear Receptor
Mol. Mass.:
57613.46
Organism:
Homo sapiens (Human)
Description:
P37231
Residue:
505
  
Inhibitor
Name:
BDBM50085042
Synonyms:
2-(4-(4-Chlorobenzoyl)phenoxy)-2-methylpropanoic acid 1-methylethyl ester FENOFIBRATE Fenofibric acid Isopropyl (4'-(p-chlorobenzoyl)-2-phenoxy-2-methyl)propionate Lipantil (TN) Tricor (TN) | propan-2-yl 2-[4-(4-chlorobenzoyl)phenoxy]-2-methylpropanoate
Type:
Small organic molecule
Emp. Form.:
C20H21ClO4
Mol. Mass.:
360.831
SMILES:
CC(C)OC(=O)C(C)(C)Oc1ccc(cc1)C(=O)c1ccc(Cl)cc1
: