Target
72 kDa type IV collagenase
Ligand
BDBM50294132
Substrate
Meas. Tech.
ChEMBL_571082 (CHEMBL813182)
Ki
1±n/a nM
Citation
 Nuti, ECasalini, FAvramova, SISantamaria, SCercignani, GMarinelli, LLa Pietra, VNovellino, EOrlandini, ENencetti, STuccinardi, TMartinelli, ALim, NHVisse, RNagase, HRossello, A N-O-isopropyl sulfonamido-based hydroxamates: design, synthesis and biological evaluation of selective matrix metalloproteinase-13 inhibitors as potential therapeutic agents for osteoarthritis. J Med Chem 52:4757-73 (2009)  
Target
Name:
72 kDa type IV collagenase
Synonyms:
72 kDa gelatinase CLG4A Gelatinase A (MMP-2) MMP2_HUMAN Matrix metalloproteinase-2 (MMP 2) Matrix metalloproteinases 2 (MMP-2) | TBE-1
Type:
Enzyme
Mol. Mass.:
73870.36
Organism:
Homo sapiens (Human)
Description:
P08253
Residue:
660
  
Inhibitor
Name:
BDBM50294132
Synonyms:
CHEMBL561963 | N-hydroxy-2-(N-isopropoxy-4'-isopropylbiphenyl-4-ylsulfonamido)-3-methylbutanamide
Type:
Small organic molecule
Emp. Form.:
C23H32N2O5S
Mol. Mass.:
448.576
SMILES:
CC(C)ON(C(C(C)C)C(=O)NO)S(=O)(=O)c1ccc(cc1)-c1ccc(cc1)C(C)C
: