Target
Beta-secretase 1
Ligand
BDBM29744
Substrate
Meas. Tech.
ChEMBL_574523 (CHEMBL1030362)
IC50
>10000±n/a nM
Citation
 Machauer, RLaumen, KVeenstra, SRondeau, JMTintelnot-Blomley, MBetschart, CJaton, ALDesrayaud, SStaufenbiel, MRabe, SPaganetti, PNeumann, U Macrocyclic peptidomimetic beta-secretase (BACE-1) inhibitors with activity in vivo. Bioorg Med Chem Lett 19:1366-70 (2009)  
Target
Name:
Beta-secretase 1
Synonyms:
ASP2 Aspartyl protease 2 BACE1 Beta-secretase (BACE) Beta-secretase 1 (BACE 1) Beta-secretase 1 (BACE1) Beta-site amyloid precursor protein cleaving enzyme 1 Memapsin-2 beta-Secretase (BACE-1) | beta-Secretase (BACE1)
Type:
Protein
Mol. Mass.:
55755.10
Organism:
Homo sapiens (Human)
Description:
P56817
Residue:
501
  
Inhibitor
Name:
BDBM29744
Synonyms:
hydroxyethylene tripeptide inhibitor, 1
Type:
Small organic molecule
Emp. Form.:
C25H49N3O4S
Mol. Mass.:
487.739
SMILES:
CCCCNC(=O)[C@H](C)C[C@H](O)[C@H](CC(C)C)NC(=O)[C@H](CCSC)NC(=O)CCC(C)C
: