Target
Sodium-dependent serotonin transporter
Ligand
BDBM50295289
Substrate
Meas. Tech.
ChEMBL_578027 (CHEMBL1064059)
IC50
22±n/a nM
Citation
 Denhart, DJDeskus, JADitta, JLGao, QDalton King, HKozlowski, ESMeng, ZLaPaglia, MAMattson, GKMolski, TFTaber, MTLodge, NJMattson, RJMacor, JE Conformationally restricted homotryptamines. Part 5: 3-(trans-2-aminomethylcyclopentyl)indoles as potent selective serotonin reuptake inhibitors. Bioorg Med Chem Lett 19:4031-3 (2009)  
Target
Name:
Sodium-dependent serotonin transporter
Synonyms:
5-HT Transporter 5HTT SC6A4_HUMAN SLC6A4 Serotonin transporter (5HTT) Sodium-dependent serotonin transporter (SERT) | Solute carrier family 6 member 4
Type:
Multi-pass membrane protein
Mol. Mass.:
70322.51
Organism:
Homo sapiens (Human)
Description:
P31645
Residue:
630
  
Inhibitor
Name:
BDBM50295289
Synonyms:
(+/-)-trans-3-(2-(pyrrolidin-1-ylmethyl)cyclopentyl)-1H-indole-5-carbonitrile | CHEMBL549490
Type:
Small organic molecule
Emp. Form.:
C19H23N3
Mol. Mass.:
293.406
SMILES:
N#Cc1ccc2[nH]cc([C@H]3CCC[C@@H]3CN3CCCC3)c2c1
: