Target
Neuropeptide Y receptor type 2
Ligand
BDBM50423655
Substrate
Meas. Tech.
ChEMBL_578231 (CHEMBL1051546)
IC50
3.3±n/a nM
Citation
 Lunniss, GEBarnes, AABarton, NBiagetti, MBianchi, FBlowers, SMCaberlotto, LEmmons, AHolmes, IPMontanari, DNorris, RWalters, DJWatson, SP The identification and optimisation of novel and selective diamide neuropeptide Y Y2 receptor antagonists. Bioorg Med Chem Lett 19:4022-5 (2009)  
Target
Name:
Neuropeptide Y receptor type 2
Synonyms:
NPY-Y2 NPY2-R NPY2R_HUMAN Y2 receptor | neuropeptide Y receptor Y2
Type:
Enzyme Catalytic Domain
Mol. Mass.:
42734.65
Organism:
Homo sapiens (Human)
Description:
NPY-Y2 NPY2R HUMAN::P49146
Residue:
381
  
Inhibitor
Name:
BDBM50423655
Synonyms:
CHEMBL2307889
Type:
Small organic molecule
Emp. Form.:
C49H57N11O6
Mol. Mass.:
896.047
SMILES:
[#7]\[#6](-[#7])=[#7]\[#6]-[#6]-[#6]-[#6@@H](-[#7]-[#6](=O)-[#6]C1([#6]-[#6](=O)-[#7]-2-[#6]-[#6]-[#7](-[#6]-[#6]-2)-[#6]-2-c3ccccc3-[#7]-[#6](=O)-c3ccccc-23)[#6]-[#6]-[#6]-[#6]1)-[#6](=O)-[#7]-[#6]-[#6]-n1c(=O)n(-c2ccccc2)n(-c2ccccc2)c1=O
: