Target
Dipeptidyl peptidase 2
Ligand
BDBM50296133
Substrate
Meas. Tech.
ChEMBL_579504 (CHEMBL1058858)
IC50
3400±n/a nM
Citation
 Nordhoff, SCerezo-Gálvez, SDeppe, HHill, OLópez-Canet, MRummey, CThiemann, MMatassa, VGEdwards, PJFeurer, A Discovery of beta-homophenylalanine based pyrrolidin-2-ylmethyl amides and sulfonamides as highly potent and selective inhibitors of dipeptidyl peptidase IV. Bioorg Med Chem Lett 19:4201-3 (2009)  
Target
Name:
Dipeptidyl peptidase 2
Synonyms:
DAP II DPP2_HUMAN Dipeptidyl aminopeptidase II Dipeptidyl peptidase 2 (DPP2) Dipeptidyl peptidase II (DPP II) Dipeptidyl peptidase II and dipeptidyl peptidase IV (DPP2 and DPP4) carboxytripeptidase dipeptidyl(amino)peptidase II | dipeptidylarylamidase
Type:
Protein
Mol. Mass.:
54339.29
Organism:
Homo sapiens (Human)
Description:
Q9UHL4
Residue:
492
  
Inhibitor
Name:
BDBM50296133
Synonyms:
CHEMBL563648 | N-(((S)-1-((R)-3-amino-4-(2,4,5-trifluorophenyl)butanoyl)pyrrolidin-2-yl)methyl)cyclopropanecarboxamide
Type:
Small organic molecule
Emp. Form.:
C19H24F3N3O2
Mol. Mass.:
383.408
SMILES:
N[C@@H](CC(=O)N1CCC[C@H]1CNC(=O)C1CC1)Cc1cc(F)c(F)cc1F
: