Target
Dipeptidyl peptidase 8
Ligand
BDBM50296141
Substrate
Meas. Tech.
ChEMBL_579505 (CHEMBL1058859)
IC50
4200±n/a nM
Citation
 Nordhoff, SCerezo-Gálvez, SDeppe, HHill, OLópez-Canet, MRummey, CThiemann, MMatassa, VGEdwards, PJFeurer, A Discovery of beta-homophenylalanine based pyrrolidin-2-ylmethyl amides and sulfonamides as highly potent and selective inhibitors of dipeptidyl peptidase IV. Bioorg Med Chem Lett 19:4201-3 (2009)  
Target
Name:
Dipeptidyl peptidase 8
Synonyms:
DPP8 DPRP-1 Dipeptidyl peptidase 8 (DPP-8) Dipeptidyl peptidase 8/9 Dipeptidyl peptidase VIII Prolyl dipeptidase DPP8
Type:
Enzyme
Mol. Mass.:
103342.62
Organism:
Homo sapiens (Human)
Description:
Q6V1X1
Residue:
898
  
Inhibitor
Name:
BDBM50296141
Synonyms:
CHEMBL560184 | N-(((S)-1-((R)-3-amino-4-(3-chlorophenyl)butanoyl)pyrrolidin-2-yl)methyl)cyclopropanesulfonamide
Type:
Small organic molecule
Emp. Form.:
C18H26ClN3O3S
Mol. Mass.:
399.935
SMILES:
N[C@@H](CC(=O)N1CCC[C@H]1CNS(=O)(=O)C1CC1)Cc1cccc(Cl)c1
: