Target
Carboxypeptidase B
Ligand
BDBM50296435
Substrate
Meas. Tech.
ChEMBL_580862 (CHEMBL1064194)
Ki
196000±n/a nM
Citation
 Fernández, DAvilés, FXVendrell, J A new type of five-membered heterocyclic inhibitors of basic metallocarboxypeptidases. Eur J Med Chem 44:3266-71 (2009)  
Target
Name:
Carboxypeptidase B
Synonyms:
CBPB1_HUMAN CPB1 PASP Pancreas-specific protein | Thrombin-activatable fibrinolysis (TAFI)
Type:
Enzyme
Mol. Mass.:
47367.43
Organism:
Homo sapiens (Human)
Description:
P15086
Residue:
417
  
Inhibitor
Name:
BDBM50296435
Synonyms:
2-(4-benzyl-5-(3-methylphenethyl)-4H-1,2,4-triazol-3-ylthio)acetic acid | CHEMBL550865
Type:
Small organic molecule
Emp. Form.:
C20H21N3O2S
Mol. Mass.:
367.465
SMILES:
Cc1cccc(CCc2nnc(SCC(O)=O)n2Cc2ccccc2)c1
: