Target
Calcitonin gene-related peptide type 1 receptor
Ligand
BDBM50296787
Substrate
Meas. Tech.
ChEMBL_582534 (CHEMBL1060867)
Ki
0.35±n/a nM
Citation
 Bell, IMBednar, RACorcoran, HAFay, JFGallicchio, SNJohnston, VKHershey, JCMiller-Stein, CMMoore, ELMosser, SDRoller, SASalvatore, CATheberge, CRWong, BKBlair Zartman, CKane, SAWilliams, TMGraham, SLVacca, JP The identification of potent, orally bioavailable tricyclic CGRP receptor antagonists. Bioorg Med Chem Lett 19:4740-2 (2009)  
Target
Name:
Calcitonin gene-related peptide type 1 receptor
Synonyms:
Adrenomedullin receptor AM1; CALCRL/RAMP2 CALRL_HUMAN CGRP type 1 receptor mRNA Calcitonin gene-related peptide (CGRP) receptor Calcitonin receptor-like receptor Human CL receptor
Type:
Enzyme Catalytic Domain
Mol. Mass.:
52980.45
Organism:
Homo sapiens (Human)
Description:
Q16602
Residue:
461
  
Inhibitor
Name:
BDBM50296787
Synonyms:
CHEMBL564088 N-((S)-2'-oxo-1,1',2',3-tetrahydrospiro[indene-2,3'-pyrrolo[2,3-b]pyridine]-5-yl)-2-(4-oxo-2a,3,4,5-tetrahydropyrrolo[4,3,2-de]quinolin-1(2H)-yl)acetamide 2
Type:
Small organic molecule
Emp. Form.:
C27H23N5O3
Mol. Mass.:
465.5032
SMILES:
O=C(CN1CC2CC(=O)Nc3cccc1c23)Nc1ccc2C[C@@]3(Cc2c1)C(=O)Nc1ncccc31
: