Target
Melanin-concentrating hormone receptor 1
Ligand
BDBM50297046
Substrate
Meas. Tech.
ChEMBL_580990 (CHEMBL1057278)
IC50
>1000±n/a nM
Citation
 Kishino, HMoriya, MSakuraba, SSakamoto, TTakahashi, HSuzuki, TMoriya, RIto, MIwaasa, HTakenaga, NIshihara, AKanatani, ASato, NFukami, T Discovery of imidazo[1,2-a]pyridines as potent MCH1R antagonists. Bioorg Med Chem Lett 19:4589-93 (2009)  
Target
Name:
Melanin-concentrating hormone receptor 1
Synonyms:
G-protein coupled receptor 24 MCH receptor 1 MCH-R1 MCHR-1 MCHR1_HUMAN Melanin-Concentrating Hormone Receptor 1 (MCH1R) Melanin-concentrating hormone receptor 1 (MCH-1) Melanin-concentrating hormone receptor 1 (MCHR-1) SLC-1 Somatostatin receptor-like protein
Type:
G Protein-Coupled Receptor (GPCR)
Mol. Mass.:
45976.27
Organism:
Homo sapiens (Human)
Description:
Membranes from CHO-K1 cells stably expressing human MCH1R were used in assays.
Residue:
422
  
Inhibitor
Name:
BDBM50297046
Synonyms:
CHEMBL562537 | ethyl 6-(4'-(trifluoromethyl)biphenyl-4-ylcarboxamido)imidazo[1,2-a]pyridine-2-carboxylate
Type:
Small organic molecule
Emp. Form.:
C24H18F3N3O3
Mol. Mass.:
453.4132
SMILES:
CCOC(=O)c1cn2cc(NC(=O)c3ccc(cc3)-c3ccc(cc3)C(F)(F)F)ccc2n1
: