Target
Muscarinic acetylcholine receptor M1
Ligand
BDBM50297133
Substrate
Meas. Tech.
ChEMBL_581790 (CHEMBL1061577)
IC50
105±n/a nM
Citation
 Wan, ZLaine, DIYan, HZhu, CWiddowson, KLBuckley, PTBurman, MFoley, JJSarau, HMSchmidt, DBWebb, EFBelmonte, KEPalovich, M Discovery of (3-endo)-3-(2-cyano-2,2-diphenylethyl)-8,8-dimethyl-8-azoniabicyclo[3.2.1]octane bromide as an efficacious inhaled muscarinic acetylcholine receptor antagonist for the treatment of COPD. Bioorg Med Chem Lett 19:4560-2 (2009)  
Target
Name:
Muscarinic acetylcholine receptor M1
Synonyms:
ACM1_HUMAN Cholinergic receptor, muscarinic 1 | Cholinergic, muscarinic M1
Type:
Protein
Mol. Mass.:
51442.54
Organism:
Homo sapiens (Human)
Description:
P11229
Residue:
460
  
Inhibitor
Name:
BDBM50297133
Synonyms:
CHEMBL561879 | endo-8-methyl-3-(2,2,2-triphenylethyl)-8-azabicyclo[3.2.1]octane
Type:
Small organic molecule
Emp. Form.:
C28H31N
Mol. Mass.:
381.5524
SMILES:
CN1[C@@H]2CC[C@@H]1CC(CC(c1ccccc1)(c1ccccc1)c1ccccc1)C2
: