Target
Cytochrome P450 2D6
Ligand
BDBM50297308
Substrate
Meas. Tech.
ChEMBL_582987 (CHEMBL1051825)
IC50
50500±n/a nM
Citation
 Moree, WJLi, BFJovic, FCoon, TYu, JGross, RSTucci, FMarinkovic, DZamani-Kord, SMalany, SBradbury, MJHernandez, LMO'Brien, ZWen, JWang, HHoare, SRPetroski, RESacaan, AMadan, ACrowe, PDBeaton, G Characterization of novel selective H1-antihistamines for clinical evaluation in the treatment of insomnia. J Med Chem 52:5307-10 (2009)  
Target
Name:
Cytochrome P450 2D6
Synonyms:
CP2D6_HUMAN CYP2DL1 Cytochrome P450 2D6 (CYP2D6) P450-DB1
Type:
Protein
Mol. Mass.:
55774.82
Organism:
Homo sapiens (Human)
Description:
P10635
Residue:
497
  
Inhibitor
Name:
BDBM50297308
Synonyms:
(-)-Dimethyl-{2-[3-((R)-1-pyrazin-2-yl-ethyl)-1H-inden-2-yl]-ethyl}-amine CHEMBL556506
Type:
Small organic molecule
Emp. Form.:
C19H23N3
Mol. Mass.:
293.406
SMILES:
C[C@H](C1=C(CCN(C)C)Cc2ccccc12)c1cnccn1
: